{"text_format":"1","workbook":"xlsx","n_sheets":5,"sheets":["Formulier","JHA AGB","tbl_JHA","xblad","referentieblad"],"not_rendered":{"charts":0,"images":1,"macros":1,"external_links":0,"defined_names":240,"comments":0,"pivot_tables":0},"unopened":[],"bounds":{"document_bytes":16777216,"sheet_cells":100000,"rows_first":2000,"rows_last":500,"rows_between":2000,"halvings":0,"cell_chars":16384,"cell_head_chars":4096},"cells_cut":0,"cells_raw":0,"read":"whole","date_system":"1900"}

{"sheet":"Formulier","index":0,"n_rows":65,"n_cols":4,"rows_kept":65,"cut":false,"hidden":false,"merged":[[2,1,2,3],[3,1,3,2],[60,1,62,3],[65,1,67,3],[23,1,23,2],[43,1,44,1],[46,1,47,1],[50,1,52,3],[55,1,57,3]]}
[null,"RIGG Invulformulier 2022"]
[null,"\nIn het formulier kunt u de jeugdhulpaanbieder met de gecontracteerde jeugdhulpproducten 2021 selecteren. \nVerstuur dit forumier naar de backoffice van de betreffende gemeente.                                                                                                                              Versie 1 januari 2021"]
[null,"In het formulier kunt u de jeugdhulpaanbieder met de gecontracteerde jeugdhulpproducten 2022 selecteren "]
[null,"Verstuur dit formulier naar de backoffice van de betreffende gemeente",null,"Versie maart 2022"]
[null,"Clientgegevens","Waarde","Opmerking"]
[null,"BSN:","012345678"]
[null,"Geboortedatum","dd-mm-jjjj"]
[null,"Geslacht","MAAK EEN KEUZE"]
[null,"Naam:","Voornamen, Achternamen Kind"]
[null,"Naamcode:","MAAK EEN KEUZE"]
[null,"Leefeenheid","MAAK EEN KEUZE"]
[null,"Adres","Grote markt 1, 1234AB, Ten Boer"]
[null,"Gemeente  (woonplaats-beginsel)","MAAK EEN KEUZE"]
[null,"Soort adres","MAAK EEN KEUZE"]
[]
{"$rows_left_out":51}
{"sheet":"JHA AGB","index":1,"n_rows":233,"n_cols":2,"rows_kept":233,"cut":false,"hidden":true,"merged":[]}
["Naam JHA","AGB-Code JHA"]
["MAAK EEN KEUZE"]
["Aardema Thuiszorg BV",75751252]
["Accare","06290104"]
["Activiteitencentrum de Brink","98102991"]
["Allerzorg BV","75751769"]
["Amannij - Zorg voor jou","98099064"]
["Ambulante Hulpverlening Groningen","98103733"]
["A-MeZo","98102550"]
["Anders Thuis",41412440]
["AndersOm Thuisbegeleiding B.V.","75752181"]
["Anouk Endeveld","90060482"]
["Autismehuis",73730430]
["Basic Trust",94057709]
["Basic Trust 't Nijland / \nOrthopedagogische praktijk 't Nijland","94063125"]
{"$rows_left_out":219}
{"sheet":"tbl_JHA","index":2,"n_rows":1699,"n_cols":13,"rows_kept":1699,"cut":false,"hidden":true,"merged":[]}
["Teller1","Num_Aanbieder","Voorziening/Product in geval ZIN","Productcode","Productomschrijving","Product categorie * ","Eenheid bij toekenning","Frequentie bij toekenning","Max tarief JHA bij traject (tarief JHA /12)","Max. tarief","Tarief voorziening/product JHA *","AGB-Code JHA","Naam JHA"]
[1,{"$f":"IF($A2=\"\",\"\",$A2&\"_\"&$M2)","v":"1_Aardema Thuiszorg BV"},{"$f":"IF($A2=\"\",\"\",$D2&\" \"&$E2)","v":"45A04 Individuele begeleiding basis"},"45A04","Individuele begeleiding basis","Ambulant","uur","Totaal binnen geldigheidsduur of tijdsonafhankelijk",null,66.75,66.2,75751252,"Aardema Thuiszorg BV"]
[2,"2_Aardema Thuiszorg BV","45A51 Gezinsbegeleiding basis","45A51","Gezinsbegeleiding basis","Ambulant","uur","Totaal binnen geldigheidsduur of tijdsonafhankelijk",null,66.75,64.600000000000009,75751252,"Aardema Thuiszorg BV"]
[3,"3_Aardema Thuiszorg BV","45A53 Individuele begeleiding specialistisch","45A53","Individuele begeleiding specialistisch","Ambulant","uur","Totaal binnen geldigheidsduur of tijdsonafhankelijk",null,85.050000000000011,80.75,75751252,"Aardema Thuiszorg BV"]
[4,"4_Aardema Thuiszorg BV","45A56 Gezinsbegeleiding specialistisch","45A56","Gezinsbegeleiding specialistisch","Ambulant","uur","Totaal binnen geldigheidsduur of tijdsonafhankelijk",null,85.050000000000011,80.75,75751252,"Aardema Thuiszorg BV"]
[5,"5_Aardema Thuiszorg BV","45G05 Specifieke doelgroepen 6 Gezinnen met geringe sociale redzaamheid met het accent op lichtere vormen van begeleiding","45G05","Specifieke doelgroepen 6 Gezinnen met geringe sociale redzaamheid met het accent op lichtere vormen van begeleiding","Specifieke doelgroepen","uur","Totaal binnen geldigheidsduur of tijdsonafhankelijk",null,82.9,80.75,75751252,"Aardema Thuiszorg BV"]
[6,"6_Aardema Thuiszorg BV","45G06 Specifieke doelgroepen 7 Gezinnen met geringe sociale redzaamheid met het accent op specialistische begeleiding en behandeling","45G06","Specifieke doelgroepen 7 Gezinnen met geringe sociale redzaamheid met het accent op specialistische begeleiding en behandeling","Specifieke doelgroepen","uur","Totaal binnen geldigheidsduur of tijdsonafhankelijk",null,97.95,93.65,75751252,"Aardema Thuiszorg BV"]
[7,"7_Aardema Thuiszorg BV","50G40 Advies en ondersteuning vanuit jeugdhulpaanbieders bij complexe problematiek","50G40","Advies en ondersteuning vanuit jeugdhulpaanbieders bij complexe problematiek","Advies","uur","Totaal binnen geldigheidsduur of tijdsonafhankelijk",null,101.2,99.000000000000014,75751252,"Aardema Thuiszorg BV"]
[{"$f":"IF($M9=\"\",\"\",IF($M9=$M8,$A8+1,1))","v":1},"1_Accare","55001 Jeugd ggz behandeling specialistisch",55001,"Jeugd ggz behandeling specialistisch","Landelijk Werkende Instelling","minuut","totaal binnen geldigheidsduur of tijdsonafhankelijk",null,null,null,"06290104","Accare"]
[2,"2_Accare","55002 Jeugd ggz diagnostiek",55002,"Jeugd ggz diagnostiek","Landelijk Werkende Instelling","minuut","totaal binnen geldigheidsduur of tijdsonafhankelijk",null,null,null,"06290104","Accare"]
[3,"3_Accare","55003 Jeugd ggz beschikbaarheidscomponent voor 24-uurs crisiszorg",55003,"Jeugd ggz beschikbaarheidscomponent voor 24-uurs crisiszorg","Landelijk Werkende Instelling","stuk","totaal binnen geldigheidsduur of tijdsonafhankelijk",null,null,null,"06290104","Accare"]
[4,"4_Accare","55004 Consultatie",55004,"Consultatie","Landelijk Werkende Instelling","minuut","totaal binnen geldigheidsduur of tijdsonafhankelijk",null,null,null,"06290104","Accare"]
[5,"5_Accare","55005 Jeugd ggz verblijf zonder overnachting",55005,"Jeugd ggz verblijf zonder overnachting","Landelijk Werkende Instelling","etmaal","totaal binnen geldigheidsduur of tijdsonafhankelijk",null,null,null,"06290104","Accare"]
[6,"6_Accare","55010 Deelprestatie verblijf GGZ E (Intensieve verzorgingsgraad)",55010,"Deelprestatie verblijf GGZ E (Intensieve verzorgingsgraad)","Landelijk Werkende Instelling","etmaal","totaal binnen geldigheidsduur of tijdsonafhankelijk",null,null,null,"06290104","Accare"]
[7,"7_Accare","55011 Deelprestatie verblijf GGZ F (Extra intensieve verzorgingsgraad)",55011,"Deelprestatie verblijf GGZ F (Extra intensieve verzorgingsgraad)","Landelijk Werkende Instelling","etmaal","totaal binnen geldigheidsduur of tijdsonafhankelijk",null,null,null,"06290104","Accare"]
{"$rows_left_out":1685}
{"sheet":"xblad","index":3,"n_rows":52,"n_cols":10,"rows_kept":52,"cut":false,"hidden":true,"merged":[]}
["Wachtwoord:",null,{"$f":"Formulier!$C$27","v":"MAAK EEN KEUZE"},"Teller1","Num_Aanbieder","Voorziening/Product in geval ZIN","Product categorie* ","Eenheid bij toekenning*","Frequentie bij toekenning*","Tarief voorziening/product JHA*"]
["Susan@CMRIGG",null,null,0,{"$f":"IF(ISERROR(VLOOKUP($D2&\"_\"&$C$1,tbl_JHA!$B:$B,1,0)),\"\",VLOOKUP($D2&\"_\"&$C$1,tbl_JHA!$B:$B,1,0))","v":""},"MAAK EEN KEUZE",{"$f":"IF(ISERROR(VLOOKUP($E2,tbl_JHA!$B:$K,MATCH(xblad!G$1,tbl_JHA!$B$1:$K$1,0),0)),\"\",VLOOKUP($E2,tbl_JHA!$B:$K,MATCH(xblad!G$1,tbl_JHA!$B$1:$K$1,0),0))","v":""},{"$f":"IF(ISERROR(VLOOKUP($E2,tbl_JHA!$B:$K,MATCH(xblad!H$1,tbl_JHA!$B$1:$K$1,0),0)),\"\",VLOOKUP($E2,tbl_JHA!$B:$K,MATCH(xblad!H$1,tbl_JHA!$B$1:$K$1,0),0))","v":""},{"$f":"IF(ISERROR(VLOOKUP($E2,tbl_JHA!$B:$K,MATCH(xblad!I$1,tbl_JHA!$B$1:$K$1,0),0)),\"\",VLOOKUP($E2,tbl_JHA!$B:$K,MATCH(xblad!I$1,tbl_JHA!$B$1:$K$1,0),0))","v":""},{"$f":"IF(ISERROR(VLOOKUP($E2,tbl_JHA!$B:$K,MATCH(xblad!J$1,tbl_JHA!$B$1:$K$1,0),0)),\"\",VLOOKUP($E2,tbl_JHA!$B:$K,MATCH(xblad!J$1,tbl_JHA!$B$1:$K$1,0),0))","v":""}]
[null,null,null,1,{"$f":"IF(ISERROR(VLOOKUP($D3&\"_\"&$C$1,tbl_JHA!$B:$B,1,0)),\"\",VLOOKUP($D3&\"_\"&$C$1,tbl_JHA!$B:$B,1,0))","v":""},{"$f":"IF(ISERROR(VLOOKUP($E3,tbl_JHA!$B:$K,MATCH(xblad!F$1,tbl_JHA!$B$1:$K$1,0),0)),\"\",VLOOKUP($E3,tbl_JHA!$B:$K,MATCH(xblad!F$1,tbl_JHA!$B$1:$K$1,0),0))","v":""},{"$f":"IF(ISERROR(VLOOKUP($E3,tbl_JHA!$B:$K,MATCH(xblad!G$1,tbl_JHA!$B$1:$K$1,0),0)),\"\",VLOOKUP($E3,tbl_JHA!$B:$K,MATCH(xblad!G$1,tbl_JHA!$B$1:$K$1,0),0))","v":""},{"$f":"IF(ISERROR(VLOOKUP($E3,tbl_JHA!$B:$K,MATCH(xblad!H$1,tbl_JHA!$B$1:$K$1,0),0)),\"\",VLOOKUP($E3,tbl_JHA!$B:$K,MATCH(xblad!H$1,tbl_JHA!$B$1:$K$1,0),0))","v":""},{"$f":"IF(ISERROR(VLOOKUP($E3,tbl_JHA!$B:$K,MATCH(xblad!I$1,tbl_JHA!$B$1:$K$1,0),0)),\"\",VLOOKUP($E3,tbl_JHA!$B:$K,MATCH(xblad!I$1,tbl_JHA!$B$1:$K$1,0),0))","v":""},{"$f":"IF(ISERROR(VLOOKUP($E3,tbl_JHA!$B:$K,MATCH(xblad!J$1,tbl_JHA!$B$1:$K$1,0),0)),\"\",VLOOKUP($E3,tbl_JHA!$B:$K,MATCH(xblad!J$1,tbl_JHA!$B$1:$K$1,0),0))","v":""}]
[null,null,null,2,{"$f":"IF(ISERROR(VLOOKUP($D4&\"_\"&$C$1,tbl_JHA!$B:$B,1,0)),\"\",VLOOKUP($D4&\"_\"&$C$1,tbl_JHA!$B:$B,1,0))","v":""},{"$f":"IF(ISERROR(VLOOKUP($E4,tbl_JHA!$B:$K,MATCH(xblad!F$1,tbl_JHA!$B$1:$K$1,0),0)),\"\",VLOOKUP($E4,tbl_JHA!$B:$K,MATCH(xblad!F$1,tbl_JHA!$B$1:$K$1,0),0))","v":""},{"$f":"IF(ISERROR(VLOOKUP($E4,tbl_JHA!$B:$K,MATCH(xblad!G$1,tbl_JHA!$B$1:$K$1,0),0)),\"\",VLOOKUP($E4,tbl_JHA!$B:$K,MATCH(xblad!G$1,tbl_JHA!$B$1:$K$1,0),0))","v":""},{"$f":"IF(ISERROR(VLOOKUP($E4,tbl_JHA!$B:$K,MATCH(xblad!H$1,tbl_JHA!$B$1:$K$1,0),0)),\"\",VLOOKUP($E4,tbl_JHA!$B:$K,MATCH(xblad!H$1,tbl_JHA!$B$1:$K$1,0),0))","v":""},{"$f":"IF(ISERROR(VLOOKUP($E4,tbl_JHA!$B:$K,MATCH(xblad!I$1,tbl_JHA!$B$1:$K$1,0),0)),\"\",VLOOKUP($E4,tbl_JHA!$B:$K,MATCH(xblad!I$1,tbl_JHA!$B$1:$K$1,0),0))","v":""},{"$f":"IF(ISERROR(VLOOKUP($E4,tbl_JHA!$B:$K,MATCH(xblad!J$1,tbl_JHA!$B$1:$K$1,0),0)),\"\",VLOOKUP($E4,tbl_JHA!$B:$K,MATCH(xblad!J$1,tbl_JHA!$B$1:$K$1,0),0))","v":""}]
[null,null,null,3,{"$f":"IF(ISERROR(VLOOKUP($D5&\"_\"&$C$1,tbl_JHA!$B:$B,1,0)),\"\",VLOOKUP($D5&\"_\"&$C$1,tbl_JHA!$B:$B,1,0))","v":""},{"$f":"IF(ISERROR(VLOOKUP($E5,tbl_JHA!$B:$K,MATCH(xblad!F$1,tbl_JHA!$B$1:$K$1,0),0)),\"\",VLOOKUP($E5,tbl_JHA!$B:$K,MATCH(xblad!F$1,tbl_JHA!$B$1:$K$1,0),0))","v":""},{"$f":"IF(ISERROR(VLOOKUP($E5,tbl_JHA!$B:$K,MATCH(xblad!G$1,tbl_JHA!$B$1:$K$1,0),0)),\"\",VLOOKUP($E5,tbl_JHA!$B:$K,MATCH(xblad!G$1,tbl_JHA!$B$1:$K$1,0),0))","v":""},{"$f":"IF(ISERROR(VLOOKUP($E5,tbl_JHA!$B:$K,MATCH(xblad!H$1,tbl_JHA!$B$1:$K$1,0),0)),\"\",VLOOKUP($E5,tbl_JHA!$B:$K,MATCH(xblad!H$1,tbl_JHA!$B$1:$K$1,0),0))","v":""},{"$f":"IF(ISERROR(VLOOKUP($E5,tbl_JHA!$B:$K,MATCH(xblad!I$1,tbl_JHA!$B$1:$K$1,0),0)),\"\",VLOOKUP($E5,tbl_JHA!$B:$K,MATCH(xblad!I$1,tbl_JHA!$B$1:$K$1,0),0))","v":""},{"$f":"IF(ISERROR(VLOOKUP($E5,tbl_JHA!$B:$K,MATCH(xblad!J$1,tbl_JHA!$B$1:$K$1,0),0)),\"\",VLOOKUP($E5,tbl_JHA!$B:$K,MATCH(xblad!J$1,tbl_JHA!$B$1:$K$1,0),0))","v":""}]
[null,null,null,4,{"$f":"IF(ISERROR(VLOOKUP($D6&\"_\"&$C$1,tbl_JHA!$B:$B,1,0)),\"\",VLOOKUP($D6&\"_\"&$C$1,tbl_JHA!$B:$B,1,0))","v":""},{"$f":"IF(ISERROR(VLOOKUP($E6,tbl_JHA!$B:$K,MATCH(xblad!F$1,tbl_JHA!$B$1:$K$1,0),0)),\"\",VLOOKUP($E6,tbl_JHA!$B:$K,MATCH(xblad!F$1,tbl_JHA!$B$1:$K$1,0),0))","v":""},{"$f":"IF(ISERROR(VLOOKUP($E6,tbl_JHA!$B:$K,MATCH(xblad!G$1,tbl_JHA!$B$1:$K$1,0),0)),\"\",VLOOKUP($E6,tbl_JHA!$B:$K,MATCH(xblad!G$1,tbl_JHA!$B$1:$K$1,0),0))","v":""},{"$f":"IF(ISERROR(VLOOKUP($E6,tbl_JHA!$B:$K,MATCH(xblad!H$1,tbl_JHA!$B$1:$K$1,0),0)),\"\",VLOOKUP($E6,tbl_JHA!$B:$K,MATCH(xblad!H$1,tbl_JHA!$B$1:$K$1,0),0))","v":""},{"$f":"IF(ISERROR(VLOOKUP($E6,tbl_JHA!$B:$K,MATCH(xblad!I$1,tbl_JHA!$B$1:$K$1,0),0)),\"\",VLOOKUP($E6,tbl_JHA!$B:$K,MATCH(xblad!I$1,tbl_JHA!$B$1:$K$1,0),0))","v":""},{"$f":"IF(ISERROR(VLOOKUP($E6,tbl_JHA!$B:$K,MATCH(xblad!J$1,tbl_JHA!$B$1:$K$1,0),0)),\"\",VLOOKUP($E6,tbl_JHA!$B:$K,MATCH(xblad!J$1,tbl_JHA!$B$1:$K$1,0),0))","v":""}]
[null,null,null,5,{"$f":"IF(ISERROR(VLOOKUP($D7&\"_\"&$C$1,tbl_JHA!$B:$B,1,0)),\"\",VLOOKUP($D7&\"_\"&$C$1,tbl_JHA!$B:$B,1,0))","v":""},{"$f":"IF(ISERROR(VLOOKUP($E7,tbl_JHA!$B:$K,MATCH(xblad!F$1,tbl_JHA!$B$1:$K$1,0),0)),\"\",VLOOKUP($E7,tbl_JHA!$B:$K,MATCH(xblad!F$1,tbl_JHA!$B$1:$K$1,0),0))","v":""},{"$f":"IF(ISERROR(VLOOKUP($E7,tbl_JHA!$B:$K,MATCH(xblad!G$1,tbl_JHA!$B$1:$K$1,0),0)),\"\",VLOOKUP($E7,tbl_JHA!$B:$K,MATCH(xblad!G$1,tbl_JHA!$B$1:$K$1,0),0))","v":""},{"$f":"IF(ISERROR(VLOOKUP($E7,tbl_JHA!$B:$K,MATCH(xblad!H$1,tbl_JHA!$B$1:$K$1,0),0)),\"\",VLOOKUP($E7,tbl_JHA!$B:$K,MATCH(xblad!H$1,tbl_JHA!$B$1:$K$1,0),0))","v":""},{"$f":"IF(ISERROR(VLOOKUP($E7,tbl_JHA!$B:$K,MATCH(xblad!I$1,tbl_JHA!$B$1:$K$1,0),0)),\"\",VLOOKUP($E7,tbl_JHA!$B:$K,MATCH(xblad!I$1,tbl_JHA!$B$1:$K$1,0),0))","v":""},{"$f":"IF(ISERROR(VLOOKUP($E7,tbl_JHA!$B:$K,MATCH(xblad!J$1,tbl_JHA!$B$1:$K$1,0),0)),\"\",VLOOKUP($E7,tbl_JHA!$B:$K,MATCH(xblad!J$1,tbl_JHA!$B$1:$K$1,0),0))","v":""}]
[null,null,null,6,{"$f":"IF(ISERROR(VLOOKUP($D8&\"_\"&$C$1,tbl_JHA!$B:$B,1,0)),\"\",VLOOKUP($D8&\"_\"&$C$1,tbl_JHA!$B:$B,1,0))","v":""},{"$f":"IF(ISERROR(VLOOKUP($E8,tbl_JHA!$B:$K,MATCH(xblad!F$1,tbl_JHA!$B$1:$K$1,0),0)),\"\",VLOOKUP($E8,tbl_JHA!$B:$K,MATCH(xblad!F$1,tbl_JHA!$B$1:$K$1,0),0))","v":""},{"$f":"IF(ISERROR(VLOOKUP($E8,tbl_JHA!$B:$K,MATCH(xblad!G$1,tbl_JHA!$B$1:$K$1,0),0)),\"\",VLOOKUP($E8,tbl_JHA!$B:$K,MATCH(xblad!G$1,tbl_JHA!$B$1:$K$1,0),0))","v":""},{"$f":"IF(ISERROR(VLOOKUP($E8,tbl_JHA!$B:$K,MATCH(xblad!H$1,tbl_JHA!$B$1:$K$1,0),0)),\"\",VLOOKUP($E8,tbl_JHA!$B:$K,MATCH(xblad!H$1,tbl_JHA!$B$1:$K$1,0),0))","v":""},{"$f":"IF(ISERROR(VLOOKUP($E8,tbl_JHA!$B:$K,MATCH(xblad!I$1,tbl_JHA!$B$1:$K$1,0),0)),\"\",VLOOKUP($E8,tbl_JHA!$B:$K,MATCH(xblad!I$1,tbl_JHA!$B$1:$K$1,0),0))","v":""},{"$f":"IF(ISERROR(VLOOKUP($E8,tbl_JHA!$B:$K,MATCH(xblad!J$1,tbl_JHA!$B$1:$K$1,0),0)),\"\",VLOOKUP($E8,tbl_JHA!$B:$K,MATCH(xblad!J$1,tbl_JHA!$B$1:$K$1,0),0))","v":""}]
[null,null,null,7,{"$f":"IF(ISERROR(VLOOKUP($D9&\"_\"&$C$1,tbl_JHA!$B:$B,1,0)),\"\",VLOOKUP($D9&\"_\"&$C$1,tbl_JHA!$B:$B,1,0))","v":""},{"$f":"IF(ISERROR(VLOOKUP($E9,tbl_JHA!$B:$K,MATCH(xblad!F$1,tbl_JHA!$B$1:$K$1,0),0)),\"\",VLOOKUP($E9,tbl_JHA!$B:$K,MATCH(xblad!F$1,tbl_JHA!$B$1:$K$1,0),0))","v":""},{"$f":"IF(ISERROR(VLOOKUP($E9,tbl_JHA!$B:$K,MATCH(xblad!G$1,tbl_JHA!$B$1:$K$1,0),0)),\"\",VLOOKUP($E9,tbl_JHA!$B:$K,MATCH(xblad!G$1,tbl_JHA!$B$1:$K$1,0),0))","v":""},{"$f":"IF(ISERROR(VLOOKUP($E9,tbl_JHA!$B:$K,MATCH(xblad!H$1,tbl_JHA!$B$1:$K$1,0),0)),\"\",VLOOKUP($E9,tbl_JHA!$B:$K,MATCH(xblad!H$1,tbl_JHA!$B$1:$K$1,0),0))","v":""},{"$f":"IF(ISERROR(VLOOKUP($E9,tbl_JHA!$B:$K,MATCH(xblad!I$1,tbl_JHA!$B$1:$K$1,0),0)),\"\",VLOOKUP($E9,tbl_JHA!$B:$K,MATCH(xblad!I$1,tbl_JHA!$B$1:$K$1,0),0))","v":""},{"$f":"IF(ISERROR(VLOOKUP($E9,tbl_JHA!$B:$K,MATCH(xblad!J$1,tbl_JHA!$B$1:$K$1,0),0)),\"\",VLOOKUP($E9,tbl_JHA!$B:$K,MATCH(xblad!J$1,tbl_JHA!$B$1:$K$1,0),0))","v":""}]
[null,null,null,8,{"$f":"IF(ISERROR(VLOOKUP($D10&\"_\"&$C$1,tbl_JHA!$B:$B,1,0)),\"\",VLOOKUP($D10&\"_\"&$C$1,tbl_JHA!$B:$B,1,0))","v":""},{"$f":"IF(ISERROR(VLOOKUP($E10,tbl_JHA!$B:$K,MATCH(xblad!F$1,tbl_JHA!$B$1:$K$1,0),0)),\"\",VLOOKUP($E10,tbl_JHA!$B:$K,MATCH(xblad!F$1,tbl_JHA!$B$1:$K$1,0),0))","v":""},{"$f":"IF(ISERROR(VLOOKUP($E10,tbl_JHA!$B:$K,MATCH(xblad!G$1,tbl_JHA!$B$1:$K$1,0),0)),\"\",VLOOKUP($E10,tbl_JHA!$B:$K,MATCH(xblad!G$1,tbl_JHA!$B$1:$K$1,0),0))","v":""},{"$f":"IF(ISERROR(VLOOKUP($E10,tbl_JHA!$B:$K,MATCH(xblad!H$1,tbl_JHA!$B$1:$K$1,0),0)),\"\",VLOOKUP($E10,tbl_JHA!$B:$K,MATCH(xblad!H$1,tbl_JHA!$B$1:$K$1,0),0))","v":""},{"$f":"IF(ISERROR(VLOOKUP($E10,tbl_JHA!$B:$K,MATCH(xblad!I$1,tbl_JHA!$B$1:$K$1,0),0)),\"\",VLOOKUP($E10,tbl_JHA!$B:$K,MATCH(xblad!I$1,tbl_JHA!$B$1:$K$1,0),0))","v":""},{"$f":"IF(ISERROR(VLOOKUP($E10,tbl_JHA!$B:$K,MATCH(xblad!J$1,tbl_JHA!$B$1:$K$1,0),0)),\"\",VLOOKUP($E10,tbl_JHA!$B:$K,MATCH(xblad!J$1,tbl_JHA!$B$1:$K$1,0),0))","v":""}]
[null,null,null,9,{"$f":"IF(ISERROR(VLOOKUP($D11&\"_\"&$C$1,tbl_JHA!$B:$B,1,0)),\"\",VLOOKUP($D11&\"_\"&$C$1,tbl_JHA!$B:$B,1,0))","v":""},{"$f":"IF(ISERROR(VLOOKUP($E11,tbl_JHA!$B:$K,MATCH(xblad!F$1,tbl_JHA!$B$1:$K$1,0),0)),\"\",VLOOKUP($E11,tbl_JHA!$B:$K,MATCH(xblad!F$1,tbl_JHA!$B$1:$K$1,0),0))","v":""},{"$f":"IF(ISERROR(VLOOKUP($E11,tbl_JHA!$B:$K,MATCH(xblad!G$1,tbl_JHA!$B$1:$K$1,0),0)),\"\",VLOOKUP($E11,tbl_JHA!$B:$K,MATCH(xblad!G$1,tbl_JHA!$B$1:$K$1,0),0))","v":""},{"$f":"IF(ISERROR(VLOOKUP($E11,tbl_JHA!$B:$K,MATCH(xblad!H$1,tbl_JHA!$B$1:$K$1,0),0)),\"\",VLOOKUP($E11,tbl_JHA!$B:$K,MATCH(xblad!H$1,tbl_JHA!$B$1:$K$1,0),0))","v":""},{"$f":"IF(ISERROR(VLOOKUP($E11,tbl_JHA!$B:$K,MATCH(xblad!I$1,tbl_JHA!$B$1:$K$1,0),0)),\"\",VLOOKUP($E11,tbl_JHA!$B:$K,MATCH(xblad!I$1,tbl_JHA!$B$1:$K$1,0),0))","v":""},{"$f":"IF(ISERROR(VLOOKUP($E11,tbl_JHA!$B:$K,MATCH(xblad!J$1,tbl_JHA!$B$1:$K$1,0),0)),\"\",VLOOKUP($E11,tbl_JHA!$B:$K,MATCH(xblad!J$1,tbl_JHA!$B$1:$K$1,0),0))","v":""}]
[null,null,null,10,{"$f":"IF(ISERROR(VLOOKUP($D12&\"_\"&$C$1,tbl_JHA!$B:$B,1,0)),\"\",VLOOKUP($D12&\"_\"&$C$1,tbl_JHA!$B:$B,1,0))","v":""},{"$f":"IF(ISERROR(VLOOKUP($E12,tbl_JHA!$B:$K,MATCH(xblad!F$1,tbl_JHA!$B$1:$K$1,0),0)),\"\",VLOOKUP($E12,tbl_JHA!$B:$K,MATCH(xblad!F$1,tbl_JHA!$B$1:$K$1,0),0))","v":""},{"$f":"IF(ISERROR(VLOOKUP($E12,tbl_JHA!$B:$K,MATCH(xblad!G$1,tbl_JHA!$B$1:$K$1,0),0)),\"\",VLOOKUP($E12,tbl_JHA!$B:$K,MATCH(xblad!G$1,tbl_JHA!$B$1:$K$1,0),0))","v":""},{"$f":"IF(ISERROR(VLOOKUP($E12,tbl_JHA!$B:$K,MATCH(xblad!H$1,tbl_JHA!$B$1:$K$1,0),0)),\"\",VLOOKUP($E12,tbl_JHA!$B:$K,MATCH(xblad!H$1,tbl_JHA!$B$1:$K$1,0),0))","v":""},{"$f":"IF(ISERROR(VLOOKUP($E12,tbl_JHA!$B:$K,MATCH(xblad!I$1,tbl_JHA!$B$1:$K$1,0),0)),\"\",VLOOKUP($E12,tbl_JHA!$B:$K,MATCH(xblad!I$1,tbl_JHA!$B$1:$K$1,0),0))","v":""},{"$f":"IF(ISERROR(VLOOKUP($E12,tbl_JHA!$B:$K,MATCH(xblad!J$1,tbl_JHA!$B$1:$K$1,0),0)),\"\",VLOOKUP($E12,tbl_JHA!$B:$K,MATCH(xblad!J$1,tbl_JHA!$B$1:$K$1,0),0))","v":""}]
[null,null,null,11,{"$f":"IF(ISERROR(VLOOKUP($D13&\"_\"&$C$1,tbl_JHA!$B:$B,1,0)),\"\",VLOOKUP($D13&\"_\"&$C$1,tbl_JHA!$B:$B,1,0))","v":""},{"$f":"IF(ISERROR(VLOOKUP($E13,tbl_JHA!$B:$K,MATCH(xblad!F$1,tbl_JHA!$B$1:$K$1,0),0)),\"\",VLOOKUP($E13,tbl_JHA!$B:$K,MATCH(xblad!F$1,tbl_JHA!$B$1:$K$1,0),0))","v":""},{"$f":"IF(ISERROR(VLOOKUP($E13,tbl_JHA!$B:$K,MATCH(xblad!G$1,tbl_JHA!$B$1:$K$1,0),0)),\"\",VLOOKUP($E13,tbl_JHA!$B:$K,MATCH(xblad!G$1,tbl_JHA!$B$1:$K$1,0),0))","v":""},{"$f":"IF(ISERROR(VLOOKUP($E13,tbl_JHA!$B:$K,MATCH(xblad!H$1,tbl_JHA!$B$1:$K$1,0),0)),\"\",VLOOKUP($E13,tbl_JHA!$B:$K,MATCH(xblad!H$1,tbl_JHA!$B$1:$K$1,0),0))","v":""},{"$f":"IF(ISERROR(VLOOKUP($E13,tbl_JHA!$B:$K,MATCH(xblad!I$1,tbl_JHA!$B$1:$K$1,0),0)),\"\",VLOOKUP($E13,tbl_JHA!$B:$K,MATCH(xblad!I$1,tbl_JHA!$B$1:$K$1,0),0))","v":""},{"$f":"IF(ISERROR(VLOOKUP($E13,tbl_JHA!$B:$K,MATCH(xblad!J$1,tbl_JHA!$B$1:$K$1,0),0)),\"\",VLOOKUP($E13,tbl_JHA!$B:$K,MATCH(xblad!J$1,tbl_JHA!$B$1:$K$1,0),0))","v":""}]
[null,null,null,12,{"$f":"IF(ISERROR(VLOOKUP($D14&\"_\"&$C$1,tbl_JHA!$B:$B,1,0)),\"\",VLOOKUP($D14&\"_\"&$C$1,tbl_JHA!$B:$B,1,0))","v":""},{"$f":"IF(ISERROR(VLOOKUP($E14,tbl_JHA!$B:$K,MATCH(xblad!F$1,tbl_JHA!$B$1:$K$1,0),0)),\"\",VLOOKUP($E14,tbl_JHA!$B:$K,MATCH(xblad!F$1,tbl_JHA!$B$1:$K$1,0),0))","v":""},{"$f":"IF(ISERROR(VLOOKUP($E14,tbl_JHA!$B:$K,MATCH(xblad!G$1,tbl_JHA!$B$1:$K$1,0),0)),\"\",VLOOKUP($E14,tbl_JHA!$B:$K,MATCH(xblad!G$1,tbl_JHA!$B$1:$K$1,0),0))","v":""},{"$f":"IF(ISERROR(VLOOKUP($E14,tbl_JHA!$B:$K,MATCH(xblad!H$1,tbl_JHA!$B$1:$K$1,0),0)),\"\",VLOOKUP($E14,tbl_JHA!$B:$K,MATCH(xblad!H$1,tbl_JHA!$B$1:$K$1,0),0))","v":""},{"$f":"IF(ISERROR(VLOOKUP($E14,tbl_JHA!$B:$K,MATCH(xblad!I$1,tbl_JHA!$B$1:$K$1,0),0)),\"\",VLOOKUP($E14,tbl_JHA!$B:$K,MATCH(xblad!I$1,tbl_JHA!$B$1:$K$1,0),0))","v":""},{"$f":"IF(ISERROR(VLOOKUP($E14,tbl_JHA!$B:$K,MATCH(xblad!J$1,tbl_JHA!$B$1:$K$1,0),0)),\"\",VLOOKUP($E14,tbl_JHA!$B:$K,MATCH(xblad!J$1,tbl_JHA!$B$1:$K$1,0),0))","v":""}]
[null,null,null,13,{"$f":"IF(ISERROR(VLOOKUP($D15&\"_\"&$C$1,tbl_JHA!$B:$B,1,0)),\"\",VLOOKUP($D15&\"_\"&$C$1,tbl_JHA!$B:$B,1,0))","v":""},{"$f":"IF(ISERROR(VLOOKUP($E15,tbl_JHA!$B:$K,MATCH(xblad!F$1,tbl_JHA!$B$1:$K$1,0),0)),\"\",VLOOKUP($E15,tbl_JHA!$B:$K,MATCH(xblad!F$1,tbl_JHA!$B$1:$K$1,0),0))","v":""},{"$f":"IF(ISERROR(VLOOKUP($E15,tbl_JHA!$B:$K,MATCH(xblad!G$1,tbl_JHA!$B$1:$K$1,0),0)),\"\",VLOOKUP($E15,tbl_JHA!$B:$K,MATCH(xblad!G$1,tbl_JHA!$B$1:$K$1,0),0))","v":""},{"$f":"IF(ISERROR(VLOOKUP($E15,tbl_JHA!$B:$K,MATCH(xblad!H$1,tbl_JHA!$B$1:$K$1,0),0)),\"\",VLOOKUP($E15,tbl_JHA!$B:$K,MATCH(xblad!H$1,tbl_JHA!$B$1:$K$1,0),0))","v":""},{"$f":"IF(ISERROR(VLOOKUP($E15,tbl_JHA!$B:$K,MATCH(xblad!I$1,tbl_JHA!$B$1:$K$1,0),0)),\"\",VLOOKUP($E15,tbl_JHA!$B:$K,MATCH(xblad!I$1,tbl_JHA!$B$1:$K$1,0),0))","v":""},{"$f":"IF(ISERROR(VLOOKUP($E15,tbl_JHA!$B:$K,MATCH(xblad!J$1,tbl_JHA!$B$1:$K$1,0),0)),\"\",VLOOKUP($E15,tbl_JHA!$B:$K,MATCH(xblad!J$1,tbl_JHA!$B$1:$K$1,0),0))","v":""}]
{"$rows_left_out":38}
{"sheet":"referentieblad","index":4,"n_rows":130,"n_cols":26,"rows_kept":130,"cut":false,"hidden":true,"merged":[[0,20,0,21]]}
[null,"IJW 1.0","COD046 - GESLACHT",null,"IJW 1.0","COD700 - NAAMCODE",null,"IJW 1.0","COD478 - LEEFEENHEID",null,"IJW 1.0","COD757 - SOORT ADRES",null,null,"Vektis-lijst",null,null,"Gemeente",null,null," verw instantieCOD459 en COD327",null,null,null,"Gemeentelijst oud"]
[]
[null,"Code","Betekenis",null,"Code","Betekenis",null,"Code","Betekenis",null,"Code","Betekenis",null,"Waarde","Betekenis","Omschrijving",null,"Gemeentecode","Gemeentenaam",null,"Code","Betekenis",null,null,"Gemeentecode","Gemeentenaam"]
[null,"0","MAAK EEN KEUZE",null,"0","MAAK EEN KEUZE",null,"0","MAAK EEN KEUZE",null,"0","MAAK EEN KEUZE",null,"0","MAAK EEN KEUZE",null,null,"0","MAAK EEN KEUZE",null,"0","MAAK EEN KEUZE",null,null,"0","MAAK EEN KEUZE"]
[null,"1","MANNELIJK",null,"1","EIGEN NAAM",null,"1","WOONT ALLEEN EN ZELFSTANDIG (EENPERSOONSHUISHOUDEN)",null,"01","GBA ADRES",null,"10","OUDER","Ook: verzorger.",null,"1979","Eemsdelta",null,"01","Gemeente",null,null,"0003","Appingedam"]
[null,"2","VROUWELIJK",null,"2","NAAM ECHTGENOOT OF GEREGISTREERD PARTNER OF ALTERNATIEVE NAAM",null,"2","WOONT ALS KIND SAMEN MET OUDER(S) IN OUDERLIJK HUIS",null,"02","CORRESPONDENTIE-ADRES",null,"01","EERSTE RELATIE/CONTACTPERSOON","",null,"0014","Groningen",null,"02","Huisarts",null,null,"0005","Bedum"]
[null,"9","NIET GESPECIFICEERD",null,"3","NAAM ECHTGENOOT OF GEREGISTREERD PARTNER GEVOLGD DOOR EIGEN NAAM",null,"3","HEEFT EEN ZELFSTANDIG HUISHOUDEN MET UITSLUITEND PARTNER",null,"03","VERBLIJFADRES",null,"02","TWEEDE RELATIE/CONTACTPERSOON","",null,"1966","Het Hogeland",null,"03","Jeugdarts",null,null,"0007","Bellingwedde"]
[null,null,null,null,"4","EIGEN NAAM GEVOLGD DOOR NAAM ECHTGENOOT OF GEREGISTREERD PARTNER",null,"4","HEEFT EEN HUISHOUDEN MET PARTNER EN THUISWONENDE KINDEREN",null,"04","TIJDELIJK VERBLIJFADRES",null,"03","CURATOR (JURIDISCH)","",null,"1952","Midden-Groningen",null,"04","Medisch specialist",null,null,"0009","Ten Boer"]
[null,null,null,null,"5","PSEUDONIEM",null,"5","HEEFT EEN HUISHOUDEN VAN VOLWASSENE MET 1 OF MEER KINDEREN",null,null,null,null,"04","FINANCIEEL (GEMACHTIGD)","",null,"1895","Oldambt",null,"05","Zelfverwijzer",null,null,"0010","Delfzijl"]
[null,null,null,null,null,null,null,"6","EEN ANDER MEERPERSOONSHUISHOUDEN",null,null,null,null,"05","FINANCIEEL (TOETSING)","",null,"0765","Pekela",null,"06","Gecertificeerde instelling",null,null,"0014","Groningen"]
[null,null,null,null,null,null,null,"7","WOONT IN EEN ZORGINSTELLING MET VERBLIJF",null,null,null,null,"06","LEEFEENHEID","",null,"0037","Stadskanaal",null,"0100","CIZ Groningen",null,null,"0015","Grootegast"]
[null,null,null,null,null,null,null,"9","ONBEKEND",null,null,null,null,"07","HULPVERLENER","Ook: zorgaanbieder, behandelaar. Anders dan specialist of huisarts.",null,"0047","Veendam",null,"0110","CIZ locatie Sellingen",null,null,"0017","Haren"]
[null,null,null,null,null,null,null,null,null,null,null,null,null,"08","SPECIALIST","",null,"1969","Westerkwartier",null,"0120","CIZ locatie Nieuwe Pekela",null,null,"0018","Hoogezand-Sappemeer"]
[null,null,null,null,null,null,null,null,null,null,null,null,null,"09","ANDERS","",null,"1950","Westerwolde",null,"0130","CIZ locatie Bedum",null,null,"0022","Leek"]
[null,null,null,null,null,null,null,null,null,null,null,null,null,"11","VOOGD","",null,null,null,null,"0140","CIZ locatie Groningen",null,null,"0024","Loppersum"]
{"$rows_left_out":115}