{"text_format":"1","workbook":"xlsx","n_sheets":5,"sheets":["Formulier","JHA AGB","tbl_JHA","xblad","referentieblad"],"not_rendered":{"charts":0,"images":1,"macros":1,"external_links":1,"defined_names":240,"comments":2,"pivot_tables":0},"unopened":[],"bounds":{"document_bytes":16777216,"sheet_cells":100000,"rows_first":2000,"rows_last":500,"rows_between":2000,"halvings":0,"cell_chars":16384,"cell_head_chars":4096},"cells_cut":0,"cells_raw":0,"read":"whole","date_system":"1900"}

{"sheet":"Formulier","index":0,"n_rows":85,"n_cols":4,"rows_kept":85,"cut":false,"hidden":false,"merged":[[74,1,77,3],[79,1,82,3],[84,1,87,3],[2,1,2,3],[3,1,3,2],[60,1,62,3],[65,1,67,3],[23,1,23,2],[43,1,44,1],[46,1,47,1],[50,1,52,3],[55,1,57,3]]}
[null,"RIGG Invulformulier 2025"]
[null,"\nIn het formulier kunt u de jeugdhulpaanbieder met de gecontracteerde jeugdhulpproducten 2021 selecteren. \nVerstuur dit forumier naar de backoffice van de betreffende gemeente.                                                                                                                              Versie 1 januari 2021"]
[null,"In het formulier kunt u de jeugdhulpaanbieder met de gecontracteerde jeugdhulpproducten 2025 selecteren "]
[null,"Verstuur dit formulier naar de backoffice van de betreffende gemeente",null,{"$f":"xblad!$A$100","v":"Versie2 november 2025"}]
[null,"Clientgegevens","Waarde","Opmerking"]
[null,"BSN:","012345678"]
[null,"Geboortedatum","dd-mm-jjjj"]
[null,"Geslacht","MAAK EEN KEUZE"]
[null,"Naam:","Voornamen, Achternamen Kind"]
[null,"Naamcode:","MAAK EEN KEUZE"]
{"$rows_left_out":76}
{"sheet":"JHA AGB","index":1,"n_rows":173,"n_cols":5,"rows_kept":173,"cut":false,"hidden":true,"merged":[]}
["Naam JHA","AGB-Code JHA","Controle","verticaal zoeken op agb Bronbest-tabblad JHA"]
["MAAK EEN KEUZE"]
["Aardema Thuiszorg B.V.",75751252,{"$f":"VLOOKUP(A3,tbl_JHA!M:M,1,0)","v":"Aardema Thuiszorg B.V."},{"$f":"VLOOKUP(B3,tbl_JHA!L:M,2,FALSE)","v":"Aardema Thuiszorg B.V."}]
["Activiteitencentrum De Brink B.V.","98102991",{"$f":"VLOOKUP(A4,tbl_JHA!M:M,1,0)","v":"Activiteitencentrum De Brink B.V."},{"$f":"VLOOKUP(B4,tbl_JHA!L:M,2,FALSE)","v":"Activiteitencentrum De Brink B.V."}]
["Ambulante hulpverlening Groningen","98103733",{"$f":"VLOOKUP(A5,tbl_JHA!M:M,1,0)","v":"Ambulante hulpverlening Groningen"},{"$f":"VLOOKUP(B5,tbl_JHA!L:M,2,FALSE)","v":"Ambulante hulpverlening Groningen"}]
["A-MeZo B.V.",98107904,{"$f":"VLOOKUP(A6,tbl_JHA!M:M,1,0)","v":"A-MeZo B.V."},{"$f":"VLOOKUP(B6,tbl_JHA!L:M,2,FALSE)","v":"A-MeZo B.V."}]
["autismehuis B.V.",73730430,{"$f":"VLOOKUP(A7,tbl_JHA!M:M,1,0)","v":"autismehuis B.V."},{"$f":"VLOOKUP(B7,tbl_JHA!L:M,2,FALSE)","v":"autismehuis B.V."}]
["BeterBrein",94060633,{"$f":"VLOOKUP(A8,tbl_JHA!M:M,1,0)","v":"BeterBrein"},{"$f":"VLOOKUP(B8,tbl_JHA!L:M,2,FALSE)","v":"BeterBrein"}]
["Bloezem Zorg Thuis B.V.","75751769",{"$f":"VLOOKUP(A9,tbl_JHA!M:M,1,0)","v":"Bloezem Zorg Thuis B.V."},{"$f":"VLOOKUP(B9,tbl_JHA!L:M,2,FALSE)","v":"Bloezem Zorg Thuis B.V."}]
["Calidad B.V.",98101345,{"$f":"VLOOKUP(A10,tbl_JHA!M:M,1,0)","v":"Calidad B.V."},{"$f":"VLOOKUP(B10,tbl_JHA!L:M,2,FALSE)","v":"Calidad B.V."}]
{"$rows_left_out":164}
{"sheet":"tbl_JHA","index":2,"n_rows":861,"n_cols":14,"rows_kept":861,"cut":false,"hidden":true,"merged":[]}
["Teller1","Num_Aanbieder","Voorziening/Product in geval ZIN","Productcode","Productomschrijving","Product categorie * ","Eenheid bij toekenning","Frequentie bij toekenning","Max tarief JHA bij traject (tarief JHA /12)","Max. tarief","Tarief voorziening/product JHA *","AGB-Code JHA","Naam JHA"]
[{"$f":"IF($M2=\"\",\"\",IF($M2=$M1,$A1+1,1))","v":1},{"$f":"IF($A2=\"\",\"\",$A2&\"_\"&$M2)","v":"1_Aardema Thuiszorg B.V."},{"$f":"IF($A2=\"\",\"\",$D2&\" \"&$E2)","v":"45A04 Individuele begeleiding basis"},"45A04","Individuele begeleiding basis","Ambulant","uur","Totaal binnen geldigheidsduur of tijdsonafhankelijk",null,81.75,81.100000000000009,75751252,"Aardema Thuiszorg B.V."]
[{"$f":"IF($M3=\"\",\"\",IF($M3=$M2,$A2+1,1))","v":2},{"$f":"IF($A3=\"\",\"\",$A3&\"_\"&$M3)","v":"2_Aardema Thuiszorg B.V."},{"$f":"IF($A3=\"\",\"\",$D3&\" \"&$E3)","v":"45A51 Gezinsbegeleiding basis"},"45A51","Gezinsbegeleiding basis","Ambulant","uur","Totaal binnen geldigheidsduur of tijdsonafhankelijk",null,81.75,79.100000000000009,75751252,"Aardema Thuiszorg B.V."]
[{"$f":"IF($M4=\"\",\"\",IF($M4=$M3,$A3+1,1))","v":3},{"$f":"IF($A4=\"\",\"\",$A4&\"_\"&$M4)","v":"3_Aardema Thuiszorg B.V."},{"$f":"IF($A4=\"\",\"\",$D4&\" \"&$E4)","v":"45A53 Individuele begeleiding specialistisch"},"45A53","Individuele begeleiding specialistisch","Ambulant","uur","Totaal binnen geldigheidsduur of tijdsonafhankelijk",null,104.15,98.850000000000009,75751252,"Aardema Thuiszorg B.V."]
[{"$f":"IF($M5=\"\",\"\",IF($M5=$M4,$A4+1,1))","v":4},{"$f":"IF($A5=\"\",\"\",$A5&\"_\"&$M5)","v":"4_Aardema Thuiszorg B.V."},{"$f":"IF($A5=\"\",\"\",$D5&\" \"&$E5)","v":"45A56 Gezinsbegeleiding specialistisch"},"45A56","Gezinsbegeleiding specialistisch","Ambulant","uur","Totaal binnen geldigheidsduur of tijdsonafhankelijk",null,104.15,98.850000000000009,75751252,"Aardema Thuiszorg B.V."]
[{"$f":"IF($M6=\"\",\"\",IF($M6=$M5,$A5+1,1))","v":1},{"$f":"IF($A6=\"\",\"\",$A6&\"_\"&$M6)","v":"1_Activiteitencentrum De Brink B.V."},{"$f":"IF($A6=\"\",\"\",$D6&\" \"&$E6)","v":"42A01 Vervoer regulier"},"42A01","Vervoer regulier","Overig","stuk","Totaal binnen geldigheidsduur of tijdsonafhankelijk",null,11.9,8.1000000000000014,"98102991","Activiteitencentrum De Brink B.V."]
[{"$f":"IF($M7=\"\",\"\",IF($M7=$M6,$A6+1,1))","v":2},{"$f":"IF($A7=\"\",\"\",$A7&\"_\"&$M7)","v":"2_Activiteitencentrum De Brink B.V."},{"$f":"IF($A7=\"\",\"\",$D7&\" \"&$E7)","v":"45A54 Groepsbegeleiding specialistisch"},"45A54","Groepsbegeleiding specialistisch","Ambulant","uur","Totaal binnen geldigheidsduur of tijdsonafhankelijk",null,26.4,16.150000000000002,"98102991","Activiteitencentrum De Brink B.V."]
[{"$f":"IF($M8=\"\",\"\",IF($M8=$M7,$A7+1,1))","v":1},{"$f":"IF($A8=\"\",\"\",$A8&\"_\"&$M8)","v":"1_Ambulante hulpverlening Groningen"},{"$f":"IF($A8=\"\",\"\",$D8&\" \"&$E8)","v":"45A04 Individuele begeleiding basis"},"45A04","Individuele begeleiding basis","Ambulant","uur","Totaal binnen geldigheidsduur of tijdsonafhankelijk",null,81.75,81.75,"98103733","Ambulante hulpverlening Groningen"]
[{"$f":"IF($M9=\"\",\"\",IF($M9=$M8,$A8+1,1))","v":2},{"$f":"IF($A9=\"\",\"\",$A9&\"_\"&$M9)","v":"2_Ambulante hulpverlening Groningen"},{"$f":"IF($A9=\"\",\"\",$D9&\" \"&$E9)","v":"45A49 Groepsbegeleiding basis"},"45A49","Groepsbegeleiding basis","Ambulant","uur","Totaal binnen geldigheidsduur of tijdsonafhankelijk",null,21.05,21.05,"98103733","Ambulante hulpverlening Groningen"]
[{"$f":"IF($M10=\"\",\"\",IF($M10=$M9,$A9+1,1))","v":3},{"$f":"IF($A10=\"\",\"\",$A10&\"_\"&$M10)","v":"3_Ambulante hulpverlening Groningen"},{"$f":"IF($A10=\"\",\"\",$D10&\" \"&$E10)","v":"45A53 Individuele begeleiding specialistisch"},"45A53","Individuele begeleiding specialistisch","Ambulant","uur","Totaal binnen geldigheidsduur of tijdsonafhankelijk",null,104.15,104.15,"98103733","Ambulante hulpverlening Groningen"]
{"$rows_left_out":852}
{"sheet":"xblad","index":3,"n_rows":100,"n_cols":10,"rows_kept":100,"cut":false,"hidden":true,"merged":[]}
["Wachtwoord:",null,{"$f":"Formulier!$C$27","v":"MAAK EEN KEUZE"},"Teller1","Num_Aanbieder","Voorziening/Product in geval ZIN","Product categorie* ","Eenheid bij toekenning*","Frequentie bij toekenning*","Tarief voorziening/product JHA*"]
["Sarena@RIGGCM",null,null,0,{"$f":"IF(ISERROR(VLOOKUP($D2&\"_\"&$C$1,tbl_JHA!$B:$B,1,0)),\"\",VLOOKUP($D2&\"_\"&$C$1,tbl_JHA!$B:$B,1,0))","v":""},"MAAK EEN KEUZE",{"$f":"IF(ISERROR(VLOOKUP($E2,tbl_JHA!$B:$K,MATCH(xblad!G$1,tbl_JHA!$B$1:$K$1,0),0)),\"\",VLOOKUP($E2,tbl_JHA!$B:$K,MATCH(xblad!G$1,tbl_JHA!$B$1:$K$1,0),0))","v":""},{"$f":"IF(ISERROR(VLOOKUP($E2,tbl_JHA!$B:$K,MATCH(xblad!H$1,tbl_JHA!$B$1:$K$1,0),0)),\"\",VLOOKUP($E2,tbl_JHA!$B:$K,MATCH(xblad!H$1,tbl_JHA!$B$1:$K$1,0),0))","v":""},{"$f":"IF(ISERROR(VLOOKUP($E2,tbl_JHA!$B:$K,MATCH(xblad!I$1,tbl_JHA!$B$1:$K$1,0),0)),\"\",VLOOKUP($E2,tbl_JHA!$B:$K,MATCH(xblad!I$1,tbl_JHA!$B$1:$K$1,0),0))","v":""},{"$f":"IF(ISERROR(VLOOKUP($E2,tbl_JHA!$B:$K,MATCH(xblad!J$1,tbl_JHA!$B$1:$K$1,0),0)),\"\",VLOOKUP($E2,tbl_JHA!$B:$K,MATCH(xblad!J$1,tbl_JHA!$B$1:$K$1,0),0))","v":""}]
[null,null,null,1,{"$f":"IF(ISERROR(VLOOKUP($D3&\"_\"&$C$1,tbl_JHA!$B:$B,1,0)),\"\",VLOOKUP($D3&\"_\"&$C$1,tbl_JHA!$B:$B,1,0))","v":""},{"$f":"IF(ISERROR(VLOOKUP($E3,tbl_JHA!$B:$K,MATCH(xblad!F$1,tbl_JHA!$B$1:$K$1,0),0)),\"\",VLOOKUP($E3,tbl_JHA!$B:$K,MATCH(xblad!F$1,tbl_JHA!$B$1:$K$1,0),0))","v":""},{"$f":"IF(ISERROR(VLOOKUP($E3,tbl_JHA!$B:$K,MATCH(xblad!G$1,tbl_JHA!$B$1:$K$1,0),0)),\"\",VLOOKUP($E3,tbl_JHA!$B:$K,MATCH(xblad!G$1,tbl_JHA!$B$1:$K$1,0),0))","v":""},{"$f":"IF(ISERROR(VLOOKUP($E3,tbl_JHA!$B:$K,MATCH(xblad!H$1,tbl_JHA!$B$1:$K$1,0),0)),\"\",VLOOKUP($E3,tbl_JHA!$B:$K,MATCH(xblad!H$1,tbl_JHA!$B$1:$K$1,0),0))","v":""},{"$f":"IF(ISERROR(VLOOKUP($E3,tbl_JHA!$B:$K,MATCH(xblad!I$1,tbl_JHA!$B$1:$K$1,0),0)),\"\",VLOOKUP($E3,tbl_JHA!$B:$K,MATCH(xblad!I$1,tbl_JHA!$B$1:$K$1,0),0))","v":""},{"$f":"IF(ISERROR(VLOOKUP($E3,tbl_JHA!$B:$K,MATCH(xblad!J$1,tbl_JHA!$B$1:$K$1,0),0)),\"\",VLOOKUP($E3,tbl_JHA!$B:$K,MATCH(xblad!J$1,tbl_JHA!$B$1:$K$1,0),0))","v":""}]
[null,null,null,2,{"$f":"IF(ISERROR(VLOOKUP($D4&\"_\"&$C$1,tbl_JHA!$B:$B,1,0)),\"\",VLOOKUP($D4&\"_\"&$C$1,tbl_JHA!$B:$B,1,0))","v":""},{"$f":"IF(ISERROR(VLOOKUP($E4,tbl_JHA!$B:$K,MATCH(xblad!F$1,tbl_JHA!$B$1:$K$1,0),0)),\"\",VLOOKUP($E4,tbl_JHA!$B:$K,MATCH(xblad!F$1,tbl_JHA!$B$1:$K$1,0),0))","v":""},{"$f":"IF(ISERROR(VLOOKUP($E4,tbl_JHA!$B:$K,MATCH(xblad!G$1,tbl_JHA!$B$1:$K$1,0),0)),\"\",VLOOKUP($E4,tbl_JHA!$B:$K,MATCH(xblad!G$1,tbl_JHA!$B$1:$K$1,0),0))","v":""},{"$f":"IF(ISERROR(VLOOKUP($E4,tbl_JHA!$B:$K,MATCH(xblad!H$1,tbl_JHA!$B$1:$K$1,0),0)),\"\",VLOOKUP($E4,tbl_JHA!$B:$K,MATCH(xblad!H$1,tbl_JHA!$B$1:$K$1,0),0))","v":""},{"$f":"IF(ISERROR(VLOOKUP($E4,tbl_JHA!$B:$K,MATCH(xblad!I$1,tbl_JHA!$B$1:$K$1,0),0)),\"\",VLOOKUP($E4,tbl_JHA!$B:$K,MATCH(xblad!I$1,tbl_JHA!$B$1:$K$1,0),0))","v":""},{"$f":"IF(ISERROR(VLOOKUP($E4,tbl_JHA!$B:$K,MATCH(xblad!J$1,tbl_JHA!$B$1:$K$1,0),0)),\"\",VLOOKUP($E4,tbl_JHA!$B:$K,MATCH(xblad!J$1,tbl_JHA!$B$1:$K$1,0),0))","v":""}]
["2025-11-01",null,null,3,{"$f":"IF(ISERROR(VLOOKUP($D5&\"_\"&$C$1,tbl_JHA!$B:$B,1,0)),\"\",VLOOKUP($D5&\"_\"&$C$1,tbl_JHA!$B:$B,1,0))","v":""},{"$f":"IF(ISERROR(VLOOKUP($E5,tbl_JHA!$B:$K,MATCH(xblad!F$1,tbl_JHA!$B$1:$K$1,0),0)),\"\",VLOOKUP($E5,tbl_JHA!$B:$K,MATCH(xblad!F$1,tbl_JHA!$B$1:$K$1,0),0))","v":""},{"$f":"IF(ISERROR(VLOOKUP($E5,tbl_JHA!$B:$K,MATCH(xblad!G$1,tbl_JHA!$B$1:$K$1,0),0)),\"\",VLOOKUP($E5,tbl_JHA!$B:$K,MATCH(xblad!G$1,tbl_JHA!$B$1:$K$1,0),0))","v":""},{"$f":"IF(ISERROR(VLOOKUP($E5,tbl_JHA!$B:$K,MATCH(xblad!H$1,tbl_JHA!$B$1:$K$1,0),0)),\"\",VLOOKUP($E5,tbl_JHA!$B:$K,MATCH(xblad!H$1,tbl_JHA!$B$1:$K$1,0),0))","v":""},{"$f":"IF(ISERROR(VLOOKUP($E5,tbl_JHA!$B:$K,MATCH(xblad!I$1,tbl_JHA!$B$1:$K$1,0),0)),\"\",VLOOKUP($E5,tbl_JHA!$B:$K,MATCH(xblad!I$1,tbl_JHA!$B$1:$K$1,0),0))","v":""},{"$f":"IF(ISERROR(VLOOKUP($E5,tbl_JHA!$B:$K,MATCH(xblad!J$1,tbl_JHA!$B$1:$K$1,0),0)),\"\",VLOOKUP($E5,tbl_JHA!$B:$K,MATCH(xblad!J$1,tbl_JHA!$B$1:$K$1,0),0))","v":""}]
[null,null,null,4,{"$f":"IF(ISERROR(VLOOKUP($D6&\"_\"&$C$1,tbl_JHA!$B:$B,1,0)),\"\",VLOOKUP($D6&\"_\"&$C$1,tbl_JHA!$B:$B,1,0))","v":""},{"$f":"IF(ISERROR(VLOOKUP($E6,tbl_JHA!$B:$K,MATCH(xblad!F$1,tbl_JHA!$B$1:$K$1,0),0)),\"\",VLOOKUP($E6,tbl_JHA!$B:$K,MATCH(xblad!F$1,tbl_JHA!$B$1:$K$1,0),0))","v":""},{"$f":"IF(ISERROR(VLOOKUP($E6,tbl_JHA!$B:$K,MATCH(xblad!G$1,tbl_JHA!$B$1:$K$1,0),0)),\"\",VLOOKUP($E6,tbl_JHA!$B:$K,MATCH(xblad!G$1,tbl_JHA!$B$1:$K$1,0),0))","v":""},{"$f":"IF(ISERROR(VLOOKUP($E6,tbl_JHA!$B:$K,MATCH(xblad!H$1,tbl_JHA!$B$1:$K$1,0),0)),\"\",VLOOKUP($E6,tbl_JHA!$B:$K,MATCH(xblad!H$1,tbl_JHA!$B$1:$K$1,0),0))","v":""},{"$f":"IF(ISERROR(VLOOKUP($E6,tbl_JHA!$B:$K,MATCH(xblad!I$1,tbl_JHA!$B$1:$K$1,0),0)),\"\",VLOOKUP($E6,tbl_JHA!$B:$K,MATCH(xblad!I$1,tbl_JHA!$B$1:$K$1,0),0))","v":""},{"$f":"IF(ISERROR(VLOOKUP($E6,tbl_JHA!$B:$K,MATCH(xblad!J$1,tbl_JHA!$B$1:$K$1,0),0)),\"\",VLOOKUP($E6,tbl_JHA!$B:$K,MATCH(xblad!J$1,tbl_JHA!$B$1:$K$1,0),0))","v":""}]
[null,null,null,5,{"$f":"IF(ISERROR(VLOOKUP($D7&\"_\"&$C$1,tbl_JHA!$B:$B,1,0)),\"\",VLOOKUP($D7&\"_\"&$C$1,tbl_JHA!$B:$B,1,0))","v":""},{"$f":"IF(ISERROR(VLOOKUP($E7,tbl_JHA!$B:$K,MATCH(xblad!F$1,tbl_JHA!$B$1:$K$1,0),0)),\"\",VLOOKUP($E7,tbl_JHA!$B:$K,MATCH(xblad!F$1,tbl_JHA!$B$1:$K$1,0),0))","v":""},{"$f":"IF(ISERROR(VLOOKUP($E7,tbl_JHA!$B:$K,MATCH(xblad!G$1,tbl_JHA!$B$1:$K$1,0),0)),\"\",VLOOKUP($E7,tbl_JHA!$B:$K,MATCH(xblad!G$1,tbl_JHA!$B$1:$K$1,0),0))","v":""},{"$f":"IF(ISERROR(VLOOKUP($E7,tbl_JHA!$B:$K,MATCH(xblad!H$1,tbl_JHA!$B$1:$K$1,0),0)),\"\",VLOOKUP($E7,tbl_JHA!$B:$K,MATCH(xblad!H$1,tbl_JHA!$B$1:$K$1,0),0))","v":""},{"$f":"IF(ISERROR(VLOOKUP($E7,tbl_JHA!$B:$K,MATCH(xblad!I$1,tbl_JHA!$B$1:$K$1,0),0)),\"\",VLOOKUP($E7,tbl_JHA!$B:$K,MATCH(xblad!I$1,tbl_JHA!$B$1:$K$1,0),0))","v":""},{"$f":"IF(ISERROR(VLOOKUP($E7,tbl_JHA!$B:$K,MATCH(xblad!J$1,tbl_JHA!$B$1:$K$1,0),0)),\"\",VLOOKUP($E7,tbl_JHA!$B:$K,MATCH(xblad!J$1,tbl_JHA!$B$1:$K$1,0),0))","v":""}]
[null,null,null,6,{"$f":"IF(ISERROR(VLOOKUP($D8&\"_\"&$C$1,tbl_JHA!$B:$B,1,0)),\"\",VLOOKUP($D8&\"_\"&$C$1,tbl_JHA!$B:$B,1,0))","v":""},{"$f":"IF(ISERROR(VLOOKUP($E8,tbl_JHA!$B:$K,MATCH(xblad!F$1,tbl_JHA!$B$1:$K$1,0),0)),\"\",VLOOKUP($E8,tbl_JHA!$B:$K,MATCH(xblad!F$1,tbl_JHA!$B$1:$K$1,0),0))","v":""},{"$f":"IF(ISERROR(VLOOKUP($E8,tbl_JHA!$B:$K,MATCH(xblad!G$1,tbl_JHA!$B$1:$K$1,0),0)),\"\",VLOOKUP($E8,tbl_JHA!$B:$K,MATCH(xblad!G$1,tbl_JHA!$B$1:$K$1,0),0))","v":""},{"$f":"IF(ISERROR(VLOOKUP($E8,tbl_JHA!$B:$K,MATCH(xblad!H$1,tbl_JHA!$B$1:$K$1,0),0)),\"\",VLOOKUP($E8,tbl_JHA!$B:$K,MATCH(xblad!H$1,tbl_JHA!$B$1:$K$1,0),0))","v":""},{"$f":"IF(ISERROR(VLOOKUP($E8,tbl_JHA!$B:$K,MATCH(xblad!I$1,tbl_JHA!$B$1:$K$1,0),0)),\"\",VLOOKUP($E8,tbl_JHA!$B:$K,MATCH(xblad!I$1,tbl_JHA!$B$1:$K$1,0),0))","v":""},{"$f":"IF(ISERROR(VLOOKUP($E8,tbl_JHA!$B:$K,MATCH(xblad!J$1,tbl_JHA!$B$1:$K$1,0),0)),\"\",VLOOKUP($E8,tbl_JHA!$B:$K,MATCH(xblad!J$1,tbl_JHA!$B$1:$K$1,0),0))","v":""}]
[null,null,null,7,{"$f":"IF(ISERROR(VLOOKUP($D9&\"_\"&$C$1,tbl_JHA!$B:$B,1,0)),\"\",VLOOKUP($D9&\"_\"&$C$1,tbl_JHA!$B:$B,1,0))","v":""},{"$f":"IF(ISERROR(VLOOKUP($E9,tbl_JHA!$B:$K,MATCH(xblad!F$1,tbl_JHA!$B$1:$K$1,0),0)),\"\",VLOOKUP($E9,tbl_JHA!$B:$K,MATCH(xblad!F$1,tbl_JHA!$B$1:$K$1,0),0))","v":""},{"$f":"IF(ISERROR(VLOOKUP($E9,tbl_JHA!$B:$K,MATCH(xblad!G$1,tbl_JHA!$B$1:$K$1,0),0)),\"\",VLOOKUP($E9,tbl_JHA!$B:$K,MATCH(xblad!G$1,tbl_JHA!$B$1:$K$1,0),0))","v":""},{"$f":"IF(ISERROR(VLOOKUP($E9,tbl_JHA!$B:$K,MATCH(xblad!H$1,tbl_JHA!$B$1:$K$1,0),0)),\"\",VLOOKUP($E9,tbl_JHA!$B:$K,MATCH(xblad!H$1,tbl_JHA!$B$1:$K$1,0),0))","v":""},{"$f":"IF(ISERROR(VLOOKUP($E9,tbl_JHA!$B:$K,MATCH(xblad!I$1,tbl_JHA!$B$1:$K$1,0),0)),\"\",VLOOKUP($E9,tbl_JHA!$B:$K,MATCH(xblad!I$1,tbl_JHA!$B$1:$K$1,0),0))","v":""},{"$f":"IF(ISERROR(VLOOKUP($E9,tbl_JHA!$B:$K,MATCH(xblad!J$1,tbl_JHA!$B$1:$K$1,0),0)),\"\",VLOOKUP($E9,tbl_JHA!$B:$K,MATCH(xblad!J$1,tbl_JHA!$B$1:$K$1,0),0))","v":""}]
[null,null,null,8,{"$f":"IF(ISERROR(VLOOKUP($D10&\"_\"&$C$1,tbl_JHA!$B:$B,1,0)),\"\",VLOOKUP($D10&\"_\"&$C$1,tbl_JHA!$B:$B,1,0))","v":""},{"$f":"IF(ISERROR(VLOOKUP($E10,tbl_JHA!$B:$K,MATCH(xblad!F$1,tbl_JHA!$B$1:$K$1,0),0)),\"\",VLOOKUP($E10,tbl_JHA!$B:$K,MATCH(xblad!F$1,tbl_JHA!$B$1:$K$1,0),0))","v":""},{"$f":"IF(ISERROR(VLOOKUP($E10,tbl_JHA!$B:$K,MATCH(xblad!G$1,tbl_JHA!$B$1:$K$1,0),0)),\"\",VLOOKUP($E10,tbl_JHA!$B:$K,MATCH(xblad!G$1,tbl_JHA!$B$1:$K$1,0),0))","v":""},{"$f":"IF(ISERROR(VLOOKUP($E10,tbl_JHA!$B:$K,MATCH(xblad!H$1,tbl_JHA!$B$1:$K$1,0),0)),\"\",VLOOKUP($E10,tbl_JHA!$B:$K,MATCH(xblad!H$1,tbl_JHA!$B$1:$K$1,0),0))","v":""},{"$f":"IF(ISERROR(VLOOKUP($E10,tbl_JHA!$B:$K,MATCH(xblad!I$1,tbl_JHA!$B$1:$K$1,0),0)),\"\",VLOOKUP($E10,tbl_JHA!$B:$K,MATCH(xblad!I$1,tbl_JHA!$B$1:$K$1,0),0))","v":""},{"$f":"IF(ISERROR(VLOOKUP($E10,tbl_JHA!$B:$K,MATCH(xblad!J$1,tbl_JHA!$B$1:$K$1,0),0)),\"\",VLOOKUP($E10,tbl_JHA!$B:$K,MATCH(xblad!J$1,tbl_JHA!$B$1:$K$1,0),0))","v":""}]
{"$rows_left_out":91}
{"sheet":"referentieblad","index":4,"n_rows":130,"n_cols":26,"rows_kept":130,"cut":false,"hidden":true,"merged":[[0,20,0,21]]}
[null,"IJW 1.0","COD046 - GESLACHT",null,"IJW 1.0","COD700 - NAAMCODE",null,"IJW 1.0","COD478 - LEEFEENHEID",null,"IJW 1.0","COD757 - SOORT ADRES",null,null,"Vektis-lijst",null,null,"Gemeente",null,null," verw instantieCOD459 en COD327",null,null,null,"Gemeentelijst oud"]
[]
[null,"Code","Betekenis",null,"Code","Betekenis",null,"Code","Betekenis",null,"Code","Betekenis",null,"Waarde","Betekenis","Omschrijving",null,"Gemeentecode","Gemeentenaam",null,"Code","Betekenis",null,null,"Gemeentecode","Gemeentenaam"]
[null,"0","MAAK EEN KEUZE",null,"0","MAAK EEN KEUZE",null,"0","MAAK EEN KEUZE",null,"0","MAAK EEN KEUZE",null,"0","MAAK EEN KEUZE",null,null,"0","MAAK EEN KEUZE",null,"0","MAAK EEN KEUZE",null,null,"0","MAAK EEN KEUZE"]
[null,"1","MANNELIJK",null,"1","EIGEN NAAM",null,"1","WOONT ALLEEN EN ZELFSTANDIG (EENPERSOONSHUISHOUDEN)",null,"01","GBA ADRES",null,"10","OUDER","Ook: verzorger.",null,"1979","Eemsdelta",null,"01","Gemeente",null,null,"0003","Appingedam"]
[null,"2","VROUWELIJK",null,"2","NAAM ECHTGENOOT OF GEREGISTREERD PARTNER OF ALTERNATIEVE NAAM",null,"2","WOONT ALS KIND SAMEN MET OUDER(S) IN OUDERLIJK HUIS",null,"02","CORRESPONDENTIE-ADRES",null,"01","EERSTE RELATIE/CONTACTPERSOON","",null,"0014","Groningen",null,"02","Huisarts",null,null,"0005","Bedum"]
[null,"9","NIET GESPECIFICEERD",null,"3","NAAM ECHTGENOOT OF GEREGISTREERD PARTNER GEVOLGD DOOR EIGEN NAAM",null,"3","HEEFT EEN ZELFSTANDIG HUISHOUDEN MET UITSLUITEND PARTNER",null,"03","VERBLIJFADRES",null,"02","TWEEDE RELATIE/CONTACTPERSOON","",null,"1966","Het Hogeland",null,"03","Jeugdarts",null,null,"0007","Bellingwedde"]
[null,null,null,null,"4","EIGEN NAAM GEVOLGD DOOR NAAM ECHTGENOOT OF GEREGISTREERD PARTNER",null,"4","HEEFT EEN HUISHOUDEN MET PARTNER EN THUISWONENDE KINDEREN",null,"04","TIJDELIJK VERBLIJFADRES",null,"03","CURATOR (JURIDISCH)","",null,"1952","Midden-Groningen",null,"04","Medisch specialist",null,null,"0009","Ten Boer"]
[null,null,null,null,"5","PSEUDONIEM",null,"5","HEEFT EEN HUISHOUDEN VAN VOLWASSENE MET 1 OF MEER KINDEREN",null,null,null,null,"04","FINANCIEEL (GEMACHTIGD)","",null,"1895","Oldambt",null,"05","Zelfverwijzer",null,null,"0010","Delfzijl"]
[null,null,null,null,null,null,null,"6","EEN ANDER MEERPERSOONSHUISHOUDEN",null,null,null,null,"05","FINANCIEEL (TOETSING)","",null,"0765","Pekela",null,"06","Gecertificeerde instelling",null,null,"0014","Groningen"]
{"$rows_left_out":120}